Reaction Details
TargetProstacyclin receptor
LigandBDBM82093
Substrate/Competitorn/a
Ki 8410±n/a nM
CommentsPDSP_5312
Citation MacDermot, JBlair, IACresp, TM Prostacyclin receptors of a neuronal hybrid cell line. Divalent citations and ligand-receptor coupling. Biochem Pharmacol30:2041-4 (1981) 
 
Prostacyclin receptor
Name:Prostacyclin receptor
Type:Enzyme Catalytic Domain
Mol. Mass.:44475.65
Organism:MOUSE
Description:Prostaglandin I2 PTGIR MOUSE::P43252
Residue:415
BDBM82093
NameBDBM82093
Synonyms:13,14-DIHYDRO-15-KETO PROSTAGLANDIN E2 CAS_363-23-5 PGE2, 13,14-dihydro15-oxo
TypeSmall organic molecule
Emp. Form.C20H32O5
Mol. Mass.352.4651
SMILESCCCCCC(=O)CC[C@H]1[C@H](O)CC(=O)[C@@H]1C\C=C/CCCC(O)=O