Reaction Details
TargetProstacyclin receptor
LigandBDBM50020300
Substrate/Competitorn/a
Ki>10000±n/a nM
CommentsPDSP_1467
Citation MacDermot, JBlair, IACresp, TM Prostacyclin receptors of a neuronal hybrid cell line. Divalent citations and ligand-receptor coupling. Biochem Pharmacol30:2041-4 (1981) 
 
Prostacyclin receptor
Name:Prostacyclin receptor
Type:Enzyme Catalytic Domain
Mol. Mass.:44475.65
Organism:MOUSE
Description:Prostaglandin I2 PTGIR MOUSE::P43252
Residue:415
BDBM50020300
NameBDBM50020300
Synonyms:(S-isomer)7-[3,5-Dihydroxy-2-(3-hydroxy-oct-1-enyl)-cyclopentyl]-hept-5-enoic acid 7-[3,5-Dihydroxy-2-(3-hydroxy-oct-1-enyl)-cyclopentyl]-hept-5-enoic acid PGF2Alpha | Prostaglandin F2alpha7-[3,5-Dihydroxy-2-(3-hydroxy-oct-1-enyl)-cyclopentyl]-hept-5-enoic acid
TypeSmall organic molecule
Emp. Form.C20H34O5
Mol. Mass.354.481
SMILESCCCCC[C@H](O)\C=C\C1[C@H](O)C[C@H](O)[C@@H]1C\C=C/CCCC(O)=O