Reaction Details
TargetProstaglandin D2 receptor
LigandBDBM50101828
Substrate/Competitorn/a
Ki 3758±n/a nM
CommentsPDSP_1459
Citation Shimizu, TYamashita, AHayaishi, O Specific binding of prostaglandin D2 to rat brain synaptic membrane. Occurrence, properties, and distribution. J Biol Chem257:13570-5 (1982) Prostaglandin D2 receptor
Name:Prostaglandin D2 receptor
Type:Enzyme Catalytic Domain
Mol. Mass.:39786.91
Organism:RAT
Description:Prostaglandin D2 PTGDR RAT::Q9R261
Residue:357
BDBM50101828
NameBDBM50101828
Synonyms:7-[(1R,2R,3R)-3-Hydroxy-2-((E)-(R)-3-hydroxy-oct-1-enyl)-5-oxo-cyclopentyl]-heptanoic acid PGE1 | US9180116, PGE1
TypeSmall organic molecule
Emp. Form.C20H34O5
Mol. Mass.354.481
SMILESCCCCC[C@@H](O)\C=C\[C@H]1[C@H](O)CC(=O)[C@@H]1CCCCCCC(O)=O