Reaction Details
TargetProstaglandin D2 receptor
LigandBDBM35847
Substrate/Competitorn/a
Ki 2948±n/a nM
CommentsPDSP_1462
Citation Shimizu, TYamashita, AHayaishi, O Specific binding of prostaglandin D2 to rat brain synaptic membrane. Occurrence, properties, and distribution. J Biol Chem257:13570-5 (1982) Prostaglandin D2 receptor
Name:Prostaglandin D2 receptor
Type:Enzyme Catalytic Domain
Mol. Mass.:39786.91
Organism:RAT
Description:Prostaglandin D2 PTGDR RAT::Q9R261
Residue:357
BDBM35847
NameBDBM35847
Synonyms:(15S)-prostaglandin E2 (5Z,13E,15S)-11alpha,15-dihydroxy-9-oxoprosta-5,13-dien-1-oic acid CHEMBL548 PGE2 [3H]PGE2 prostaglandin E2
Typeradiolabeled ligand
Emp. Form.C20H32O5
Mol. Mass.352.4651
SMILESCCCCC[C@H](O)\C=C\[C@H]1[C@H](O)CC(=O)[C@@H]1C\C=C/CCCC(O)=O