Reaction Details
TargetProstaglandin D2 receptor
LigandBDBM50020300
Substrate/Competitorn/a
Ki 693±n/a nM
CommentsPDSP_1467
Citation Shimizu, TYamashita, AHayaishi, O Specific binding of prostaglandin D2 to rat brain synaptic membrane. Occurrence, properties, and distribution. J Biol Chem257:13570-5 (1982) Prostaglandin D2 receptor
Name:Prostaglandin D2 receptor
Type:Enzyme Catalytic Domain
Mol. Mass.:39786.91
Organism:RAT
Description:Prostaglandin D2 PTGDR RAT::Q9R261
Residue:357
BDBM50020300
NameBDBM50020300
Synonyms:(S-isomer)7-[3,5-Dihydroxy-2-(3-hydroxy-oct-1-enyl)-cyclopentyl]-hept-5-enoic acid 7-[3,5-Dihydroxy-2-(3-hydroxy-oct-1-enyl)-cyclopentyl]-hept-5-enoic acid PGF2Alpha | Prostaglandin F2alpha7-[3,5-Dihydroxy-2-(3-hydroxy-oct-1-enyl)-cyclopentyl]-hept-5-enoic acid
TypeSmall organic molecule
Emp. Form.C20H34O5
Mol. Mass.354.481
SMILESCCCCC[C@H](O)\C=C\C1[C@H](O)C[C@H](O)[C@@H]1C\C=C/CCCC(O)=O