Reaction Details
TargetThromboxane A2 receptor
LigandBDBM50101828
Substrate/Competitorn/a
Ki>10000±n/a nM
CommentsPDSP_1459
Citation Armstrong, RAJones, RLWilson, NH Ligand binding to thromboxane receptors on human platelets: correlation with biological activity. Br J Pharmacol79:953-64 (1983) 
 
Thromboxane A2 receptor
Name:Thromboxane A2 receptor
Type:Enzyme Catalytic Domain
Mol. Mass.:37114.77
Organism:MOUSE
Description:Thromboxane A2 TBXA2R MOUSE::P30987
Residue:341
BDBM50101828
NameBDBM50101828
Synonyms:7-[(1R,2R,3R)-3-Hydroxy-2-((E)-(R)-3-hydroxy-oct-1-enyl)-5-oxo-cyclopentyl]-heptanoic acid PGE1 | US9180116, PGE1
TypeSmall organic molecule
Emp. Form.C20H34O5
Mol. Mass.354.481
SMILESCCCCC[C@@H](O)\C=C\[C@H]1[C@H](O)CC(=O)[C@@H]1CCCCCCC(O)=O