Reaction Details
TargetCholecystokinin
LigandBDBM82079
Substrate/Competitorn/a
Ki 31.7±n/a nM
CommentsPDSP_2674
Citation Van Dijk, ARichards, JGTrzeciak, AGillessen, DMöhler, H Cholecystokinin receptors: biochemical demonstration and autoradiographical localization in rat brain and pancreas using [3H] cholecystokinin8 as radioligand. J Neurosci4:1021-33 (1984) Cholecystokinin
Name:Cholecystokinin
Type:Enzyme Catalytic Domain
Mol. Mass.:12844.29
Organism:RAT
Description:Cholecystokinin 0 RAT::P01355
Residue:115
BDBM82079
NameBDBM82079
Synonyms:CAS_152221 NSC_152221
TypeSmall organic molecule
Emp. Form.C35H46N6O8
Mol. Mass.678.7751
SMILESCCCCOC(=O)NC(=O)C(Cc1ccccc1)NC(=O)C(CC(O)=O)NC(=O)C(CC(C)C)NC(=O)C(N)Cc1c[nH]c2ccccc12