Reaction Details
TargetCholecystokinin
LigandBDBM82242
Substrate/Competitorn/a
Ki 9.2±n/a nM
CommentsPDSP_2683
Citation Van Dijk, ARichards, JGTrzeciak, AGillessen, DMöhler, H Cholecystokinin receptors: biochemical demonstration and autoradiographical localization in rat brain and pancreas using [3H] cholecystokinin8 as radioligand. J Neurosci4:1021-33 (1984) Cholecystokinin
Name:Cholecystokinin
Type:Enzyme Catalytic Domain
Mol. Mass.:12844.29
Organism:RAT
Description:Cholecystokinin 0 RAT::P01355
Residue:115
BDBM82242
NameBDBM82242
Synonyms:[Mox6]-CCK8
TypeSmall organic molecule
Emp. Form.C49H62N10O17S2
Mol. Mass.1127.203
SMILESCOCC[C@H](NC(=O)[C@H](Cc1c[nH]c2ccccc12)NC(=O)CNC(=O)[C@H](CCSC)NC(=O)[C@H](Cc1ccc(OS(O)(=O)=O)cc1)NC(=O)[C@@H](N)CC(O)=O)C(=O)N[C@@H](CC(O)=O)C(=O)N[C@@H](Cc1ccccc1)C(N)=O