Reaction Details
TargetCholecystokinin
LigandBDBM82234
Substrate/Competitorn/a
Ki 51.3±n/a nM
CommentsPDSP_2681
Citation Van Dijk, ARichards, JGTrzeciak, AGillessen, DMöhler, H Cholecystokinin receptors: biochemical demonstration and autoradiographical localization in rat brain and pancreas using [3H] cholecystokinin8 as radioligand. J Neurosci4:1021-33 (1984) Cholecystokinin
Name:Cholecystokinin
Type:Enzyme Catalytic Domain
Mol. Mass.:12844.29
Organism:RAT
Description:Cholecystokinin 0 RAT::P01355
Residue:115
BDBM82234
NameBDBM82234
Synonyms:[NLeu2]-CCK4
TypeSmall organic molecule
Emp. Form.C34H44N6O8
Mol. Mass.664.7486
SMILESCCCCOC(=O)NC(=O)C(Cc1ccccc1)NC(=O)C(CC(O)=O)NC(=O)C(NC(=O)C(N)Cc1c[nH]c2ccccc12)C(C)C