Reaction Details
TargetD(2) dopamine receptor
LigandBDBM55121
Substrate/Competitorn/a
Ki 310±n/a nM
CommentsPDSP_728
Citation Zahniser, NRDubocovich, ML Comparison of dopamine receptor sites labeled by [3H]-S-sulpiride and [3H]-spiperone in striatum. J Pharmacol Exp Ther227:592-9 (1983) D(2) dopamine receptor
Name:D(2) dopamine receptor
Type:G Protein-Coupled Receptor (GPCR)
Mol. Mass.:50931.60
Organism:Rattus norvegicus (rat)
Description:P61169
Residue:444
BDBM55121
NameBDBM55121
Synonyms:3-HYDROXYTYRAMINE HYDROCHLORIDE 4-(2-aminoethyl)pyrocatechol;hydrochloride Dopamine SMR000059081 | cid_65340
TypeSmall organic molecule
Emp. Form.C8H11NO2
Mol. Mass.153.1784
SMILESNCCc1ccc(O)c(O)c1