Reaction Details
TargetD(2) dopamine receptor
LigandBDBM81874
Substrate/Competitorn/a
Ki 1300±n/a nM
CommentsPDSP_732
Citation Zahniser, NRDubocovich, ML Comparison of dopamine receptor sites labeled by [3H]-S-sulpiride and [3H]-spiperone in striatum. J Pharmacol Exp Ther227:592-9 (1983) D(2) dopamine receptor
Name:D(2) dopamine receptor
Type:G Protein-Coupled Receptor (GPCR)
Mol. Mass.:50931.60
Organism:Rattus norvegicus (rat)
Description:P61169
Residue:444
BDBM81874
NameBDBM81874
Synonyms:Dopamine+ (GTP+) NPA+ (GTP+)
Typen/a
Emp. Form.C10H15N5O14P3
Mol. Mass.522.173
SMILESNc1nc2n(cnc2c(=O)[nH]1)[C@@H]1O[C@H](COP(O)(=O)OP(O)(=O)OP(O)([O-])=O)[C@@H](O)[C@H]1O