Reaction Details
TargetD(2) dopamine receptor
LigandBDBM50019396
Substrate/Competitorn/a
Ki 85±n/a nM
CommentsPDSP_1266
Citation Zahniser, NRDubocovich, ML Comparison of dopamine receptor sites labeled by [3H]-S-sulpiride and [3H]-spiperone in striatum. J Pharmacol Exp Ther227:592-9 (1983) D(2) dopamine receptor
Name:D(2) dopamine receptor
Type:Enzyme Catalytic Domain
Mol. Mass.:50660.69
Organism:RABBIT
Description:DOPAMINE D2 DRD2 RABBIT::G1T1Q0
Residue:443
BDBM50019396
NameBDBM50019396
Synonyms:4-(2-Dipropylamino-ethyl)-benzene-1,2-diol CHEMBL15564 | N,N-di-n-Propyldopamine
TypeSmall organic molecule
Emp. Form.C14H23NO2
Mol. Mass.237.3379
SMILESCCCN(CCC)CCc1ccc(O)c(O)c1