Reaction Details
TargetD(2) dopamine receptor
LigandBDBM21395
Substrate/Competitorn/a
Ki 720±n/a nM
CommentsPDSP_1583
Citation Zahniser, NRDubocovich, ML Comparison of dopamine receptor sites labeled by [3H]-S-sulpiride and [3H]-spiperone in striatum. J Pharmacol Exp Ther227:592-9 (1983) D(2) dopamine receptor
Name:D(2) dopamine receptor
Type:G Protein-Coupled Receptor (GPCR)
Mol. Mass.:50931.60
Organism:Rattus norvegicus (rat)
Description:P61169
Residue:444
BDBM21395
NameBDBM21395
Synonyms:3-(2-(4-(4-Fluorobenzoyl)piperidinol)ethyl)-2,4(1H,3H)-quinazolinedione CHEMBL1628637 Ketanserin R-41-468 [3H]-Ketanserin
Typeradiolabeled ligand
Emp. Form.C22H22FN3O3
Mol. Mass.395.4268
SMILESFc1ccc(cc1)C(=O)C1CCN(CCn2c(=O)[nH]c3ccccc3c2=O)CC1