Reaction Details
TargetD(2) dopamine receptor
LigandBDBM21395
Substrate/Competitorn/a
Ki 880±n/a nM
CommentsPDSP_1583
Citation Zahniser, NRDubocovich, ML Comparison of dopamine receptor sites labeled by [3H]-S-sulpiride and [3H]-spiperone in striatum. J Pharmacol Exp Ther227:592-9 (1983) D(2) dopamine receptor
Name:D(2) dopamine receptor
Type:Enzyme Catalytic Domain
Mol. Mass.:50660.69
Organism:RABBIT
Description:DOPAMINE D2 DRD2 RABBIT::G1T1Q0
Residue:443
BDBM21395
NameBDBM21395
Synonyms:3-(2-(4-(4-Fluorobenzoyl)piperidinol)ethyl)-2,4(1H,3H)-quinazolinedione CHEMBL1628637 Ketanserin R-41-468 [3H]-Ketanserin
Typeradiolabeled ligand
Emp. Form.C22H22FN3O3
Mol. Mass.395.4268
SMILESFc1ccc(cc1)C(=O)C1CCN(CCn2c(=O)[nH]c3ccccc3c2=O)CC1