Reaction Details
TargetD(2) dopamine receptor
LigandBDBM81774
Substrate/Competitorn/a
Ki 31±n/a nM
CommentsPDSP_1785
Citation Zahniser, NRDubocovich, ML Comparison of dopamine receptor sites labeled by [3H]-S-sulpiride and [3H]-spiperone in striatum. J Pharmacol Exp Ther227:592-9 (1983) D(2) dopamine receptor
Name:D(2) dopamine receptor
Type:Enzyme Catalytic Domain
Mol. Mass.:50660.69
Organism:RABBIT
Description:DOPAMINE D2 DRD2 RABBIT::G1T1Q0
Residue:443
BDBM81774
NameBDBM81774
Synonyms:CAS_15676-16-1 Sulpiride-S | Sulpiride-l
Typen/a
Emp. Form.C15H23N3O4S
Mol. Mass.341.426
SMILESCCN1CCC[C@H]1CNC(=O)c1cc(ccc1OC)S(N)(=O)=O