Reaction Details
TargetVoltage-dependent L-type calcium channel subunit alpha-1C
LigandBDBM82056
Substrate/Competitorn/a
Ki 0.5±n/a nM
CommentsPDSP_2655
Citation Ehlert, FJRoeske, WRItoga, EYamamura, HI The binding of [3H]nitrendipine to receptors for calcium channel antagonists in the heart, cerebral cortex, and ileum of rats. Life Sci30:2191-202 (1982) 
 
Voltage-dependent L-type calcium channel subunit alpha-1C
Name:Voltage-dependent L-type calcium channel subunit alpha-1C
Type:Enzyme Catalytic Domain
Mol. Mass.:243492.26
Organism:RAT
Description:Calcium channel 0 RAT::P22002
Residue:2169
BDBM82056
NameBDBM82056
Synonyms:CAS_4499 Nisoldipine
TypeSmall organic molecule
Emp. Form.C20H24N2O6
Mol. Mass.388.4144
SMILESCOC(=O)C1C(C(C(=O)OCC(C)C)=C(C)N=C1C)c1ccccc1[N+]([O-])=O