Reaction Details
TargetGlutamate receptor ionotropic, kainate 1
LigandBDBM50053588
Substrate/Competitorn/a
Ki>10000±n/a nM
CommentsPDSP_4809
Citation Thomsen, CBoel, ESuzdak, PD Actions of phenylglycine analogs at subtypes of the metabotropic glutamate receptor family. Eur J Pharmacol267:77-84 (1994) 
 
Glutamate receptor ionotropic, kainate 1
Name:Glutamate receptor ionotropic, kainate 1
Type:Enzyme Catalytic Domain
Mol. Mass.:107860.82
Organism:RAT
Description:P22756
Residue:949
BDBM50053588
NameBDBM50053588
Synonyms:(S)-4-(amino(carboxy)methyl)benzoic acid 4-((S)-Amino-carboxy-methyl)-benzoic acid CHEMBL94990 | S-4-Carboxyphenylglycine
TypeSmall organic molecule
Emp. Form.C9H9NO4
Mol. Mass.195.1721
SMILESN[C@H](C(O)=O)c1ccc(cc1)C(O)=O