Reaction Details
TargetGlutamate receptor ionotropic, NMDA 1
LigandBDBM82252
Substrate/Competitorn/a
Ki>10000±n/a nM
CommentsPDSP_4810
Citation Thomsen, CBoel, ESuzdak, PD Actions of phenylglycine analogs at subtypes of the metabotropic glutamate receptor family. Eur J Pharmacol267:77-84 (1994) 
 
Glutamate receptor ionotropic, NMDA 1
Name:Glutamate receptor ionotropic, NMDA 1
Type:Enzyme Catalytic Domain
Mol. Mass.:105533.40
Organism:RAT
Description:P35439
Residue:938
BDBM82252
NameBDBM82252
Synonyms:(R)-3-Hydroxyphenylglyci
Typen/a
Emp. Form.C8H9NO3
Mol. Mass.167.162
SMILESN[C@@H](C(O)=O)c1cccc(O)c1