Reaction Details
TargetGlutamate receptor ionotropic, NMDA 1
LigandBDBM82251
Substrate/Competitorn/a
Ki>10000±n/a nM
CommentsPDSP_4808
Citation Thomsen, CBoel, ESuzdak, PD Actions of phenylglycine analogs at subtypes of the metabotropic glutamate receptor family. Eur J Pharmacol267:77-84 (1994) 
 
Glutamate receptor ionotropic, NMDA 1
Name:Glutamate receptor ionotropic, NMDA 1
Type:Enzyme Catalytic Domain
Mol. Mass.:105533.40
Organism:RAT
Description:P35439
Residue:938
BDBM82251
NameBDBM82251
Synonyms:(R)-4-Carboxyphenylglycine CAS_134052-68-9
TypeSmall organic molecule
Emp. Form.C9H9NO4
Mol. Mass.195.1721
SMILESN[C@@H](C(O)=O)c1ccc(cc1)C(O)=O