Reaction Details
TargetMetabotropic glutamate receptor 2
LigandBDBM82250
Substrate/Competitorn/a
Ki>10000±n/a nM
CommentsPDSP_4812
Citation Thomsen, CBoel, ESuzdak, PD Actions of phenylglycine analogs at subtypes of the metabotropic glutamate receptor family. Eur J Pharmacol267:77-84 (1994) 
 
Metabotropic glutamate receptor 2
Name:Metabotropic glutamate receptor 2
Type:Enzyme
Mol. Mass.:95584.88
Organism:Homo sapiens (Human)
Description:Q14416
Residue:872
BDBM82250
NameBDBM82250
Synonyms:(R)-3-Carboxy-4-hydroxyphenylglycine CB7394016
TypeSmall organic molecule
Emp. Form.C9H9NO5
Mol. Mass.211.1715
SMILESN[C@@H](C(O)=O)c1ccc(O)c(c1)C(O)=O