Reaction Details
TargetSomatostatin receptor type 1
LigandBDBM82257
Substrate/Competitorn/a
Ki>10000±n/a nM
CommentsPDSP_3339
Citation Rossowski, WJGu, ZFAkarca, USJensen, RTCoy, DH Characterization of somatostatin receptor subtypes controlling rat gastric acid and pancreatic amylase release. Peptides15:1421-4 (1994) 
 
Somatostatin receptor type 1
Name:Somatostatin receptor type 1
Type:Enzyme Catalytic Domain
Mol. Mass.:42752.93
Organism:RAT
Description:SOMATOSTATIN SST1 SSTR1 RAT::P28646
Residue:391
BDBM82257
NameBDBM82257
Synonyms:D-Phe-Phe-Tyr-D-Trp-Lys-Val-Phe-Thr-NH2 | DC-25-12
Typen/a
Emp. Form.C61H75N11O10
Mol. Mass.1122.3159
SMILESCC(C)[C@H](NC(=O)[C@H](CCCCN)NC(=O)[C@H](Cc1c[nH]c2ccccc12)NC(=O)[C@H](Cc1ccc(O)cc1)NC(=O)[C@H](Cc1ccccc1)NC(=O)C(N)c1ccccc1)C(=O)N[C@@H](Cc1ccccc1)C(=O)N[C@@H]([C@@H](C)O)C(N)=O