Reaction Details
TargetMu-type opioid receptor
LigandBDBM82269
Substrate/Competitorn/a
Ki 34.5±n/a nM
CommentsPDSP_4106
Citation Codd, EEShank, RPSchupsky, JJRaffa, RB Serotonin and norepinephrine uptake inhibiting activity of centrally acting analgesics: structural determinants and role in antinociception. J Pharmacol Exp Ther274:1263-70 (1995) Mu-type opioid receptor
Name:Mu-type opioid receptor
Type:G Protein-Coupled Receptor (GPCR)
Mol. Mass.:44503.11
Organism:Rattus norvegicus (rat)
Description:Competition binding assays were carried out using membrane preparations from transfected HN9.10 cells that constitutively expressed the mu opioid receptor.
Residue:398
BDBM82269
NameBDBM82269
Synonyms:(+)-alpha-Propoxyphene PROPOXYPHENE | Propoxyphene-d
TypeSmall organic molecule
Emp. Form.C22H29NO2
Mol. Mass.339.4712
SMILESCCC(=O)O[C@@](Cc1ccccc1)([C@H](C)CN(C)C)c1ccccc1