Reaction Details
TargetMelatonin receptor type 1A
LigandBDBM29611
Substrate/Competitorn/a
Ki 0.09±n/a nM
CommentsPDSP_1192
Citation Reppert, SMGodson, CMahle, CDWeaver, DRSlaugenhaupt, SAGusella, JF Molecular characterization of a second melatonin receptor expressed in human retina and brain: the Mel1b melatonin receptor. Proc Natl Acad Sci U S A92:8734-8 (1995) 
 
Melatonin receptor type 1A
Name:Melatonin receptor type 1A
Type:Enzyme
Mol. Mass.:39392.94
Organism:Homo sapiens (Human)
Description:P48039
Residue:350
BDBM29611
NameBDBM29611
Synonyms:2-Iodomelatonin Melatonin,2-Iodo
TypeSmall organic molecule
Emp. Form.C13H15IN2O2
Mol. Mass.358.1749
SMILESCOc1ccc2[nH]c(I)c(CCNC(C)=O)c2c1