Reaction Details
TargetMelatonin receptor type 1A
LigandBDBM50034110
Substrate/Competitorn/a
Ki 0.21±n/a nM
CommentsPDSP_1193
Citation Reppert, SMGodson, CMahle, CDWeaver, DRSlaugenhaupt, SAGusella, JF Molecular characterization of a second melatonin receptor expressed in human retina and brain: the Mel1b melatonin receptor. Proc Natl Acad Sci U S A92:8734-8 (1995) 
 
Melatonin receptor type 1A
Name:Melatonin receptor type 1A
Type:Enzyme
Mol. Mass.:39392.94
Organism:Homo sapiens (Human)
Description:P48039
Residue:350
BDBM50034110
NameBDBM50034110
Synonyms:CHEMBL15060 N-[2-(5-Methoxy-2-phenyl-1H-indol-3-yl)-ethyl]-acetamide
TypeSmall organic molecule
Emp. Form.C19H20N2O2
Mol. Mass.308.3743
SMILESCOc1ccc2[nH]c(c(CCNC(C)=O)c2c1)-c1ccccc1