Reaction Details
TargetMelatonin receptor type 1A
LigandBDBM50035179
Substrate/Competitorn/a
Ki 0.72±n/a nM
CommentsPDSP_1657
Citation Reppert, SMGodson, CMahle, CDWeaver, DRSlaugenhaupt, SAGusella, JF Molecular characterization of a second melatonin receptor expressed in human retina and brain: the Mel1b melatonin receptor. Proc Natl Acad Sci U S A92:8734-8 (1995) 
 
Melatonin receptor type 1A
Name:Melatonin receptor type 1A
Type:Enzyme
Mol. Mass.:39392.94
Organism:Homo sapiens (Human)
Description:P48039
Residue:350
BDBM50035179
NameBDBM50035179
Synonyms:Agomelatine N-[2-(7-Methoxy-naphthalen-1-yl)-ethyl]-acetamide S 20098 US11091445, Compound code IA2-76
TypeSmall organic molecule
Emp. Form.C15H17NO2
Mol. Mass.243.301
SMILESCOc1ccc2cccc(CCNC(C)=O)c2c1