Reaction Details
Target5-hydroxytryptamine receptor 7
LigandBDBM50017721
Substrate/Competitorn/a
Ki 125.89±n/a nM
CommentsPDSP_606
Citation To, ZPBonhaus, DWEglen, RMJakeman, LB Characterization and distribution of putative 5-ht7 receptors in guinea-pig brain. Br J Pharmacol115:107-16 (1995) 
 
5-hydroxytryptamine receptor 7
Name:5-hydroxytryptamine receptor 7
Type:Enzyme Catalytic Domain
Mol. Mass.:49632.36
Organism:GUINEA PIG
Description:5-HT7 HTR7 GUINEA PIG::P50407
Residue:446
BDBM50017721
NameBDBM50017721
Synonyms:1-Methyl-4-(5H-dibenzo(a,d)cycloheptenylidene)piperidine 4-(5-dibenzo(a,d)cyclohepten-5-ylidine)-1-methylpiperidine 4-(5H-dibenzo[a,d][7]annulen-5-ylidene)-1-methylpiperidine4-(5H-dibenzo[a,d]cyclohepten-5-ylidene)-1-methylpiperidine CHEMBL516 | CYPROHEPTADINE
TypeSmall organic molecule
Emp. Form.C21H21N
Mol. Mass.287.3981
SMILES[#6]-[#7]-1-[#6]-[#6]\[#6](-[#6]-[#6]-1)=[#6]-1/c2ccccc2-[#6]=[#6]-c2ccccc-12