Reaction Details
Target5-hydroxytryptamine receptor 7
LigandBDBM50028421
Substrate/Competitorn/a
Ki 2.95±n/a nM
CommentsPDSP_1453
Citation To, ZPBonhaus, DWEglen, RMJakeman, LB Characterization and distribution of putative 5-ht7 receptors in guinea-pig brain. Br J Pharmacol115:107-16 (1995) 
 
5-hydroxytryptamine receptor 7
Name:5-hydroxytryptamine receptor 7
Type:Enzyme Catalytic Domain
Mol. Mass.:49632.36
Organism:GUINEA PIG
Description:5-HT7 HTR7 GUINEA PIG::P50407
Residue:446
BDBM50028421
NameBDBM50028421
Synonyms:9-Methylsulfanylmethyl-7-propyl-4,6,6a,7,8,9,10,10a-octahydro-indolo[4,3-fg]quinoline; compound with methanesulfonic acid LY-127809 Pergolide | Permax
TypeSmall organic molecule
Emp. Form.C19H26N2S
Mol. Mass.314.488
SMILESCCCN1C[C@H](CSC)C[C@H]2[C@H]1Cc1c[nH]c3cccc2c13