Reaction Details
TargetNicotinic acetylcholine receptor
LigandBDBM50061562
Substrate/Competitorn/a
Ki 39±n/a nM
CommentsPDSP_666
Citation Houghtling, RADávila-García, MIKellar, KJ Characterization of (+/-)(-)[3H]epibatidine binding to nicotinic cholinergic receptors in rat and human brain. Mol Pharmacol48:280-7 (1995) Nicotinic acetylcholine receptor
Name:Nicotinic acetylcholine receptor
Type:Enzyme Catalytic Domain
Mol. Mass.:2478.99
Organism:RAT
Description:n-AChR 0 RAT::Q62594
Residue:23
BDBM50061562
NameBDBM50061562
Synonyms:(12R,13aR)-12-Methoxy-1,4,5,6,9,11,12,13-octahydro-8H-pyrano[4',3':3,4]pyrido[2,1-i]indol-2-one Dihydro-Beta-erythroidine
TypeSmall organic molecule
Emp. Form.C16H21NO3
Mol. Mass.275.3428
SMILESCO[C@@H]1CC=C2CCN3CCC4=C(CC(=O)OC4)[C@@]23C1