Reaction Details
TargetAcetylcholinesterase
LigandBDBM82305
Substrate/Competitorn/a
Meas. Tech.Enzyme Assay
pH4±0
Temperature298.15±0 K
IC50 2.30±0.09 nM
Citation Bunyapaiboonsri, TRamström, OLohmann, SLehn, JMPeng, LGoeldner, M Dynamic deconvolution of a pre-equilibrated dynamic combinatorial library of acetylcholinesterase inhibitors. Chembiochem2:438-44 (2001) 
 
Acetylcholinesterase
Name:Acetylcholinesterase
Type:Enzyme
Mol. Mass.:66739.82
Organism:Torpedo marmorata (Marbled electric ray)
Description:P07692
Residue:590
BDBM82305
NameBDBM82305
Synonyms:Terephthalaldehyde, 4-I-4
TypeSmall organic molecule
Emp. Form.C22H22N6O2
Mol. Mass.402.448
SMILESO=C(C[n+]1ccccc1)NN=Cc1ccc(C=NNC(=O)C[n+]2ccccc2)cc1