Reaction Details
TargetAcetylcholinesterase
LigandBDBM50119793
Substrate/Competitorn/a
Meas. Tech.Enzyme Assay
pH4±0
Temperature298.15±0 K
IC50 16.0±1.3 nM
Citation Bunyapaiboonsri, TRamström, OLohmann, SLehn, JMPeng, LGoeldner, M Dynamic deconvolution of a pre-equilibrated dynamic combinatorial library of acetylcholinesterase inhibitors. Chembiochem2:438-44 (2001) 
 
Acetylcholinesterase
Name:Acetylcholinesterase
Type:Enzyme
Mol. Mass.:66739.82
Organism:Torpedo marmorata (Marbled electric ray)
Description:P07692
Residue:590
BDBM50119793
NameBDBM50119793
Synonyms:1,1'-(dodecane-1,12-diyl)dipyridinium bromide 1,12-bis(pyridinium)-dodecane dibromide 1,12-di(1-pyridiniumyl)dodecane; with dibromide ions | CHEMBL102757
TypeSmall organic molecule
Emp. Form.C22H34N2
Mol. Mass.326.5177
SMILESC(CCCCCC[n+]1ccccc1)CCCCC[n+]1ccccc1