Reaction Details
TargetSigma non-opioid intracellular receptor 1
LigandBDBM82351
Substrate/Competitorn/a
Meas. Tech.Sigma 1 Assay
pH7.4±0
Temperature310.15±0 K
Ki 14.2±4 nM
Citation Yarim, MKoksal, MSchepmann, DWünsch, B Synthesis and in vitro Evaluation of Novel Indole-Based Sigma Receptors Ligands. Chem Biol Drug Des78:869-75 (2011) 
 
Sigma non-opioid intracellular receptor 1
Name:Sigma non-opioid intracellular receptor 1
Type:Protein
Mol. Mass.:25307.17
Organism:Cavia porcellus (Guinea pig)
Description:Q60492
Residue:223
BDBM82351
NameBDBM82351
Synonyms:1-{[4-(substitutedphenyl/phenylethyl)piperazin1-yl]methyl}-3-methyl-1 H-indole, 3b
TypeSmall organic molecule
Emp. Form.C22H27N3
Mol. Mass.333.4699
SMILESCc1cn(CN2CCN(CCc3ccccc3)CC2)c2ccccc12