Reaction Details
TargetGlutamate metabotropic receptor 1
LigandBDBM17657
Substrate/Competitorn/a
Ki>10000±n/a nM
CommentsPDSP_873
Citation Joly, CGomeza, JBrabet, ICurry, KBockaert, JPin, JP Molecular, functional, and pharmacological characterization of the metabotropic glutamate receptor type 5 splice variants: comparison with mGluR1. J Neurosci15:3970-81 (1995) Glutamate metabotropic receptor 1
Name:Glutamate metabotropic receptor 1
Synonyms:Metabotropic Glutamate 1a
Type:Enzyme Catalytic Domain
Mol. Mass.:101383.99
Organism:PORCINE
Description:F1S737
Residue:906
BDBM17657
NameBDBM17657
TypeAmino Acid
Emp. Form.C5H9NO4
Mol. Mass.147.1293
SMILESN[C@@H](CCC(O)=O)C(O)=O