Reaction Details
TargetGlutamate metabotropic receptor 5
LigandBDBM17657
Substrate/Competitorn/a
Ki 7670±n/a nM
CommentsPDSP_873
Citation Joly, CGomeza, JBrabet, ICurry, KBockaert, JPin, JP Molecular, functional, and pharmacological characterization of the metabotropic glutamate receptor type 5 splice variants: comparison with mGluR1. J Neurosci15:3970-81 (1995) Glutamate metabotropic receptor 5
Name:Glutamate metabotropic receptor 5
Type:Enzyme Catalytic Domain
Mol. Mass.:120646.45
Organism:PORCINE
Description:metabotropic glutamate 5a 0 PORCINE::H0VDS0
Residue:1094
BDBM17657
NameBDBM17657
Synonyms:(2S)-2-aminopentanedioic acid D-Glutamate L-Glu L-Glutamic acid L-gluatmate
TypeAmino Acid
Emp. Form.C5H9NO4
Mol. Mass.147.1293
SMILESN[C@@H](CCC(O)=O)C(O)=O