Reaction Details
TargetGlutamate metabotropic receptor 5
LigandBDBM82355
Substrate/Competitorn/a
Ki 1930±n/a nM
CommentsPDSP_3205
Citation Joly, CGomeza, JBrabet, ICurry, KBockaert, JPin, JP Molecular, functional, and pharmacological characterization of the metabotropic glutamate receptor type 5 splice variants: comparison with mGluR1. J Neurosci15:3970-81 (1995) Glutamate metabotropic receptor 5
Name:Glutamate metabotropic receptor 5
Type:Enzyme Catalytic Domain
Mol. Mass.:120646.45
Organism:PORCINE
Description:metabotropic glutamate 5a 0 PORCINE::H0VDS0
Residue:1094
BDBM82355
NameBDBM82355
Synonyms:Amino-(3-hydroxy-isoxazol-5-yl)-acetic acid(Ibotenic acid) CHEMBL284895 Ibotenic acid | NSC_1233
TypeSmall organic molecule
Emp. Form.C5H6N2O4
Mol. Mass.158.1121
SMILESNC(C(O)=O)c1cc(=O)[nH]o1