Reaction Details
TargetVIP peptides
LigandBDBM82358
Substrate/Competitorn/a
Ki 8±n/a nM
CommentsPDSP_2391
Citation Gourlet, PWoussen-Colle, MCRobberecht, Pde Neef, PCauvin, AVandermeers-Piret, MCVandermeers, AChristophe, J Structural requirements for the binding of the pituitary adenylate-cyclase-activating peptide to receptors and adenylate-cyclase activation in pancreatic and neuronal membranes. Eur J Biochem195:535-41 (1991) 
 
VIP peptides
Name:VIP peptides
Type:Enzyme Catalytic Domain
Mol. Mass.:19168.43
Organism:Homo sapiens (Human)
Description:P01282
Residue:170
BDBM82358
NameBDBM82358
Synonyms:PACAP-VIP
TypeSmall organic molecule
Emp. Form.C146H236N42O43S
Mol. Mass.3299.757
SMILESCCC(C)C(NC(=O)CNC(=O)C(CC(O)=O)NC(=O)C(CO)NC(=O)C(N)Cc1cnc[nH]1)C(=O)NC(Cc1ccccc1)C(=O)NC(C(C)O)C(=O)NC(CC(O)=O)C(=O)NC(CO)C(=O)NC(Cc1ccc(O)cc1)C(=O)NC(C(C)O)C(=O)NC(CCCN=C(N)N)C(=O)NC(CC(C)C)C(=O)NC(CCCN=C(N)N)C(=O)NC(CCCCN)C(=O)NC(CCC(N)=O)C(=O)NC(CCSC)C(=O)NC(C)C(=O)NC(C(C)C)C(=O)NC(CCCCN)C(=O)NC(CCCCN)C(=O)NC(Cc1ccc(O)cc1)C(=O)NC(CC(C)C)C(=O)NC(CC(N)=O)C(=O)NC(CO)C(=O)NC(C(C)CC)C(=O)NC(CC(C)C)C(=O)NC(CC(N)=O)C(O)=O