Reaction Details
TargetVIP peptides
LigandBDBM82357
Substrate/Competitorn/a
Ki 40±n/a nM
CommentsPDSP_2394
Citation Gourlet, PWoussen-Colle, MCRobberecht, Pde Neef, PCauvin, AVandermeers-Piret, MCVandermeers, AChristophe, J Structural requirements for the binding of the pituitary adenylate-cyclase-activating peptide to receptors and adenylate-cyclase activation in pancreatic and neuronal membranes. Eur J Biochem195:535-41 (1991) 
 
VIP peptides
Name:VIP peptides
Type:Enzyme Catalytic Domain
Mol. Mass.:19168.43
Organism:Homo sapiens (Human)
Description:P01282
Residue:170
BDBM82357
NameBDBM82357
Synonyms:[Tyr13]VIP
TypeSmall organic molecule
Emp. Form.C151H236N42O45S
Mol. Mass.3391.809
SMILESCCC(C)C(NC(=O)C(CO)NC(=O)C(CC(N)=O)NC(=O)C(CC(C)C)NC(=O)C(Cc1ccc(O)cc1)NC(=O)C(CCCCN)NC(=O)C(CCCCN)NC(=O)C(NC(=O)C(C)NC(=O)C(CCSC)NC(=O)C(CCC(N)=O)NC(=O)C(CCCCN)NC(=O)C(CCCN=C(N)N)NC(=O)C(CCc1ccc(O)cc1)NC(=O)C(CCCN=C(N)N)NC(=O)C(NC(=O)C(Cc1ccc(O)cc1)NC(=O)C(CC(O)=O)NC(=O)C(CC(O)=O)NC(=O)C(NC(=O)C(Cc1ccccc1)NC(=O)C(NC(=O)C(C)NC(=O)C(CC(O)=O)NC(=O)C(CO)NC(=O)C(N)Cc1cnc[nH]1)C(C)C)C(C)O)C(C)O)C(C)C)C(=O)NC(CC(C)C)C(=O)NC(CC(N)=O)C(O)=O