Reaction Details
TargetMuscarinic acetylcholine receptor M2
LigandBDBM50010101
Substrate/Competitorn/a
Ki 32.36±n/a nM
CommentsPDSP_3900
Citation Lazareno, SBuckley, NJRoberts, FF Characterization of muscarinic M4 binding sites in rabbit lung, chicken heart, and NG108-15 cells. Mol Pharmacol38:805-15 (1990) Muscarinic acetylcholine receptor M2
Name:Muscarinic acetylcholine receptor M2
Type:Enzyme Catalytic Domain
Mol. Mass.:51555.53
Organism:RAT
Description:P10980
Residue:466
BDBM50010101
NameBDBM50010101
Synonyms:2-(diethylamino)ethyl 1-cyclohexylcyclohexanecarboxylate Bicyclohexyl-1-carboxylic acid 2-diethylamino-ethyl ester DICYCLOMINE | Dicycloverin
TypeSmall organic molecule
Emp. Form.C19H35NO2
Mol. Mass.309.4867
SMILESCCN(CC)CCOC(=O)C1(CCCCC1)C1CCCCC1