Reaction Details
TargetMuscarinic acetylcholine receptor M4
LigandBDBM82379
Substrate/Competitorn/a
Ki 2.04±n/a nM
CommentsPDSP_3897
Citation Lazareno, SBuckley, NJRoberts, FF Characterization of muscarinic M4 binding sites in rabbit lung, chicken heart, and NG108-15 cells. Mol Pharmacol38:805-15 (1990) Muscarinic acetylcholine receptor M4
Name:Muscarinic acetylcholine receptor M4
Type:Enzyme Catalytic Domain
Mol. Mass.:54968.10
Organism:Chick
Description:Cholinergic, muscarinic M4 CHRM4 Chick::P17200
Residue:490
BDBM82379
NameBDBM82379
Synonyms:BTM 1042 hydrochloride CAS_87687-13-6
TypeSmall organic molecule
Emp. Form.C21H25N3OS
Mol. Mass.367.508
SMILESCN1CCN(C[C@@H]2[C@@H](Sc3ccccc3NC2=O)c2ccccc2)CC1