Reaction Details
TargetMuscarinic acetylcholine receptor
LigandBDBM82376
Substrate/Competitorn/a
Ki 2.63±n/a nM
CommentsPDSP_1795
Citation Lazareno, SBuckley, NJRoberts, FF Characterization of muscarinic M4 binding sites in rabbit lung, chicken heart, and NG108-15 cells. Mol Pharmacol38:805-15 (1990) Muscarinic acetylcholine receptor
Name:Muscarinic acetylcholine receptor
Type:Enzyme Catalytic Domain
Mol. Mass.:53017.26
Organism:RABBIT
Description:Cholinergic, muscarinic M4 CHRM4 RABBIT::PPPPPP
Residue:478
BDBM82376
NameBDBM82376
Synonyms:CAS_80880-90-6 TELENZEPINE
TypeSmall organic molecule
Emp. Form.C19H22N4O2S
Mol. Mass.370.469
SMILESCN1CCN(CC(=O)N2c3c(C)scc3C(=O)Nc3ccccc23)CC1