Reaction Details
TargetAlpha-2C adrenergic receptor
LigandBDBM81814
Substrate/Competitorn/a
Ki 1±n/a nM
CommentsPDSP_1711
Citation Megens, AALeysen, JEAwouters, FHNiemegeers, CJ Further validation of in vivo and in vitro pharmacological procedures for assessing the alpha 2/alpha 1-selectivity of test compounds: (1). Alpha-adrenoceptor antagonists. Eur J Pharmacol129:49-55 (1986) 
 
Alpha-2C adrenergic receptor
Name:Alpha-2C adrenergic receptor
Type:Enzyme Catalytic Domain
Mol. Mass.:49890.50
Organism:RAT
Description:adrenergic Alpha2 0 RAT::P22086
Residue:458
BDBM81814
NameBDBM81814
Synonyms:5H-THIAZOLO[3,2A]PYRIMIDIN-5-ONE, 6-[2-[4-(4-FLUOROBENZOYL)-1-PIPERIDINYL]ETHYL]-2,3-DIHYDRO-7-METHYL- SEPTOPERONE | SETOPERONE
TypeSmall organic molecule
Emp. Form.C21H24FN3O2S
Mol. Mass.401.498
SMILESCc1nc2SCCn2c(=O)c1CCN1CCC(CC1)C(=O)c1ccc(F)cc1