Reaction Details
TargetCholecystokinin
LigandBDBM82387
Substrate/Competitorn/a
Ki 1.4±n/a nM
CommentsPDSP_48
Citation Evans, BEBock, MGRittle, KEDiPardo, RMWhitter, WLVeber, DFAnderson, PSFreidinger, RM Design of potent, orally effective, nonpeptidal antagonists of the peptide hormone cholecystokinin. Proc Natl Acad Sci U S A83:4918-22 (1986) 
 
Cholecystokinin
Name:Cholecystokinin
Type:Enzyme Catalytic Domain
Mol. Mass.:12844.29
Organism:RAT
Description:Cholecystokinin 0 RAT::P01355
Residue:115
BDBM82387
NameBDBM82387
Synonyms:CCK antagonist synthetic 22
Typen/a
Emp. Form.C25H19FN4O2
Mol. Mass.426.4424
SMILESCN1c2ccc(F)cc2C(=NC(NC(=O)c2cc3ccccc3[nH]2)C1=O)c1ccccc1