Reaction Details
TargetSubstance-P receptor
LigandBDBM50051290
Substrate/Competitorn/a
Ki 2000±n/a nM
CommentsPDSP_3772
Citation Emonds-Alt, XBichon, DDucoux, JPHeaulme, MMiloux, BPoncelet, MProietto, VVan Broeck, DVilain, PNeliat, G SR 142801, the first potent non-peptide antagonist of the tachykinin NK3 receptor. Life Sci56:0-32 (1995) 
 
Substance-P receptor
Name:Substance-P receptor
Type:G Protein-Coupled Receptor (GPCR)
Mol. Mass.:46371.54
Organism:Rattus norvegicus (rat)
Description:Competition binding assays were carried out using membrane preparations from transfected CHO cells that constitutively expressed the rat NK1 receptor.
Residue:407
BDBM50051290
NameBDBM50051290
Synonyms:CHEMBL299377 SR 142801 SR-142801
TypeSmall organic molecule
Emp. Form.C35H41Cl2N3O2
Mol. Mass.606.625
SMILESCN(C(C)=O)C1(CCN(CCCC2(CCCN(C2)C(=O)c2ccccc2)c2ccc(Cl)c(Cl)c2)CC1)c1ccccc1