Reaction Details
Target5-hydroxytryptamine receptor 2A
LigandBDBM81778
Substrate/Competitorn/a
Ki 4.5±n/a nM
CommentsPDSP_3932
Citation Karlsson, PFarde, LHalldin, CSwahn, CGSedvall, GFoged, CHansen, KTSkrumsager, B PET examination of [11C]NNC 687 and [11C]NNC 756 as new radioligands for the D1-dopamine receptor. Psychopharmacology (Berl)113:149-56 (1993) 
 
5-hydroxytryptamine receptor 2A
Name:5-hydroxytryptamine receptor 2A
Type:G Protein-Coupled Receptor (GPCR)
Mol. Mass.:52852.05
Organism:Rattus norvegicus (rat)
Description:Rat cortex membranes 5-HT2A receptors.
Residue:471
BDBM81778
NameBDBM81778
Synonyms:CAS_132421 NSC_132421
TypeSmall organic molecule
Emp. Form.C19H20ClNO2
Mol. Mass.329.821
SMILESCN1CCc2cc(Cl)c(O)cc2C(C1)c1cccc2CCOc12