Reaction Details
TargetSomatostatin receptor type 1
LigandBDBM82465
Substrate/Competitorn/a
Ki 1000±n/a nM
CommentsPDSP_374
Citation Hoyer, DLübbert, HBruns, C Molecular pharmacology of somatostatin receptors. Naunyn Schmiedebergs Arch Pharmacol350:441-53 (1994) 
 
Somatostatin receptor type 1
Name:Somatostatin receptor type 1
Type:Enzyme
Mol. Mass.:42692.81
Organism:Homo sapiens (Human)
Description:P30872
Residue:391
BDBM82465
NameBDBM82465
Synonyms:BIM 23023 D-Phe-L-Cys(1)-L-Tyr-D-Trp-L-Lys-L-Abu-L-Cys(1)-L-Thr-NH2
TypeSmall organic molecule
Emp. Form.C49H65N11O10S2
Mol. Mass.1032.238
SMILESCC[C@@H]1NC(=O)[C@H](CCCCN)NC(=O)[C@@H](Cc2c[nH]c3ccccc23)NC(=O)[C@H](Cc2ccc(O)cc2)NC(=O)[C@H](CSSC[C@H](NC1=O)C(=O)N[C@@H]([C@@H](C)O)C(N)=O)NC(=O)[C@H](N)Cc1ccccc1