Reaction Details
TargetSomatostatin receptor type 1
LigandBDBM82456
Substrate/Competitorn/a
Ki 1000±n/a nM
CommentsPDSP_376
Citation Hoyer, DLübbert, HBruns, C Molecular pharmacology of somatostatin receptors. Naunyn Schmiedebergs Arch Pharmacol350:441-53 (1994) 
 
Somatostatin receptor type 1
Name:Somatostatin receptor type 1
Type:Enzyme
Mol. Mass.:42692.81
Organism:Homo sapiens (Human)
Description:P30872
Residue:391
BDBM82456
NameBDBM82456
Synonyms:BIM 23030 | CAS_117580-24-2
TypeSmall organic molecule
Emp. Form.C45H57N9O8S2
Mol. Mass.916.12
SMILESCC(C)[C@@H]1NC(=O)[C@H](CCCCN)NC(=O)[C@@H](Cc2c[nH]c3ccccc23)NC(=O)[C@H](Cc2ccc(O)cc2)NC(=O)CCSSC(NC1=O)C(=O)N[C@@H](Cc1ccccc1)C(N)=O