Reaction Details
TargetSomatostatin receptor type 4
LigandBDBM82462
Substrate/Competitorn/a
Ki 1000±n/a nM
CommentsPDSP_388
Citation Hoyer, DLübbert, HBruns, C Molecular pharmacology of somatostatin receptors. Naunyn Schmiedebergs Arch Pharmacol350:441-53 (1994) 
 
Somatostatin receptor type 4
Name:Somatostatin receptor type 4
Type:PROTEIN
Mol. Mass.:41937.48
Organism:Mus musculus
Description:ChEMBL_833920
Residue:385
BDBM82462
NameBDBM82462
Synonyms:BIM 23059 | D-Nal-c[Cys-Tyr-D-Trp-Lys-Thr-Cys]-Thr-NH2
TypeSmall organic molecule
Emp. Form.C54H68N12O12S2
Mol. Mass.1141.321
SMILESCC(CO)C(NC(=O)C1NC(=O)N[C@@H](Cc2ccc(O)cc2)C(=O)N[C@H](Cc2c[nH]c3ccccc23)C(=O)N[C@@H](CCCCN)C(=O)N[C@@H](C(C)CO)C(=O)NC(SS1)C(=O)N[C@@H](Cc1ccc2ccccc2c1)C(N)=O)C(N)=O