Reaction Details
TargetSomatostatin receptor type 5
LigandBDBM81766
Substrate/Competitorn/a
Ki 5.49±n/a nM
CommentsPDSP_1242
Citation Hoyer, DLübbert, HBruns, C Molecular pharmacology of somatostatin receptors. Naunyn Schmiedebergs Arch Pharmacol350:441-53 (1994) 
 
Somatostatin receptor type 5
Name:Somatostatin receptor type 5
Type:Enzyme Catalytic Domain
Mol. Mass.:39986.50
Organism:RAT
Description:SOMATOSTATIN SST5 SSTR5 RAT::P30938
Residue:363
BDBM81766
NameBDBM81766
Synonyms:CAS_3086456 NSC_3086456
TypeSmall organic molecule
Emp. Form.C44H56N8O7
Mol. Mass.808.9648
SMILESCC(C)C1NC(=O)C(CCCCN)NC(=O)C(Cc2c[nH]c3ccccc23)NC(=O)C(Cc2ccc(O)cc2)NC(=O)C(C)N(C)C(=O)C(Cc2ccccc2)NC1=O