Reaction Details
TargetAlpha-2A adrenergic receptor
LigandBDBM50013515
Substrate/Competitorn/a
Ki 0.26±n/a nM
CommentsPDSP_1590
Citation Bockman, CSJeffries, WBAbel, PW Binding and functional characterization of alpha-2 adrenergic receptor subtypes on pig vascular endothelium. J Pharmacol Exp Ther267:1126-33 (1993) Alpha-2A adrenergic receptor
Name:Alpha-2A adrenergic receptor
Type:Enzyme Catalytic Domain
Mol. Mass.:48998.96
Organism:PIG
Description:adrenergic Alpha2 0 PIG::P18871
Residue:450
BDBM50013515
NameBDBM50013515
Synonyms:(+)-yohimbine 17alpha-hydroxyyohimban-16alpha-carboxylic acid methyl ester CORYNANTHINE Quebrachin YOHIMBINE CHLORIDE Yohimbine cid_8969 methyl 17alpha-hydroxyyohimban-16alpha-carboxylate yohimbic acid methyl ester
TypeSmall organic molecule
Emp. Form.C21H26N2O3
Mol. Mass.354.4427
SMILESCOC(=O)[C@H]1[C@@H](O)CC[C@H]2CN3CCc4c([nH]c5ccccc45)[C@@H]3C[C@H]12