Reaction Details
TargetAlpha-2A adrenergic receptor
LigandBDBM30712
Substrate/Competitorn/a
Ki 33.11±n/a nM
CommentsPDSP_1428
Citation O'Rourke, MFBlaxall, HSIversen, LJBylund, DB Characterization of [3H]RX821002 binding to alpha-2 adrenergic receptor subtypes. J Pharmacol Exp Ther268:1362-7 (1994) Alpha-2A adrenergic receptor
Name:Alpha-2A adrenergic receptor
Type:Enzyme Catalytic Domain
Mol. Mass.:49275.13
Organism:BOVINE
Description:adrenergic Alpha2 0 BOVINE::Q28838
Residue:452
BDBM30712
NameBDBM30712
Synonyms:6-tert-butyl-3-(2-imidazolin-2-ylmethyl)-2,4-dimethyl-phenol;hydrochloride 6-tert-butyl-3-(4,5-dihydro-1H-imidazol-2-ylmethyl)-2,4-dimethylphenol;hydrochloride Oxymetazoline cid_66259
TypeSmall organic molecule
Emp. Form.C16H24N2O
Mol. Mass.260.3746
SMILESCc1cc(c(O)c(C)c1CC1=NCCN1)C(C)(C)C