Reaction Details
TargetGastrin/cholecystokinin type B receptor
LigandBDBM82403
Substrate/Competitorn/a
Ki 6.3±n/a nM
CommentsPDSP_2204
Citation Nishida, AMiyata, KTsutsumi, RYuki, HAkuzawa, SKobayashi, AKamato, TIto, HYamano, MKatuyama, Y Pharmacological profile of (R)-1-[2,3-dihydro-1-(2'-methylphenacyl)-2-oxo- 5-phenyl-1H-1,4-benzodiazepin-3-yl]-3-(3-methylphenyl)urea (YM022), a new potent and selective gastrin/cholecystokinin-B receptor antagonist, in vitro and in vivo. J Pharmacol Exp Ther269:725-31 (1994) Gastrin/cholecystokinin type B receptor
Name:Gastrin/cholecystokinin type B receptor
Type:Enzyme Catalytic Domain
Mol. Mass.:48980.43
Organism:RAT
Description:Cholecystokinin A CCKBR RAT::P30553
Residue:452
BDBM82403
NameBDBM82403
Synonyms:CAS_108186 NSC_108186
TypeSmall organic molecule
Emp. Form.C35H42N4O6
Mol. Mass.614.7312
SMILESCC(Cc1c[nH]c2ccccc12)(NC(=O)OC1C2CC3CC(C2)CC1C3)C(=O)NCC(NC(=O)CCC(O)=O)c1ccccc1